Enurement Clause
type: Class
alternative label: 生效条款
subclass of: RDe0RKU39BlhcyACJW30ZLc
definition: An Enurement Clause is a provision in a contract that ensures the benefits or obligations of the contract extend to third parties who were not originally parties to the contract.