Last Will and Testament
type: Class
alternative label: 遗嘱
subclass of: RB4GQZ26zq1PJ9m6vGUuoiy
definition: A Last Will and Testament is a legal document that outlines a person's wishes for the distribution of their property and assets after their death, and is a type of Trusts and Estate Planning Document.