Urdu
type: Class
alternative label: 乌尔都语
subclass of: RDOvAHsvY8TKJ1O1orXPM9o
definition: Urdu (Language) is a structured system of communication consisting of grammar and vocabulary, primarily spoken in Pakistan and India.