Aleut
type: Class
alternative label: 阿留申人
subclass of: R7N6wsHsNyqgPE4xFK8wKJx
subclass of: RDOvAHsvY8TKJ1O1orXPM9o
definition: Aleut (Language) is a structured system of communication spoken by the Aleut people, which belongs to the Language top-level class in the context of legal matters.