Trespassing Livestock Causing Harm
type: Class
alternative label: 非法入侵的牲畜造成伤害
subclass of: R8XMs89zuZc9chn6WQ9Fgbm
subclass of: RCwxVWPUdbPjn2tWtFJg6IZ
definition: The concept of Trespassing Livestock Causing Harm refers to the legal claim that arises when someone's animals enter another person's property without permission and cause damage or injury.