Obscenity
type: Class
alternative label: 淫秽
subclass of: RCqBiJAwLT5iG2nvk12tNKW
definition: Obscenity refers to a criminal offense that involves the distribution or display of materials that are considered offensive or indecent according to community standards.