Confidentiality Clause
type: Class
alternative label: 保密条款
subclass of: RDe0RKU39BlhcyACJW30ZLc
definition: A confidentiality clause is a provision in a contract that requires one or more parties to keep certain information confidential and not disclose it to others.