Sicilian
type: Class
alternative label: 西西里语
subclass of: RDOvAHsvY8TKJ1O1orXPM9o
definition: Sicilian (Language) refers to a written or spoken structured system of communication that consists of grammar and vocabulary specific to the Sicilian region of Italy.