Hmong; Mong
type: Class
alternative label: 苗族; 蒙古族
subclass of: RDOvAHsvY8TKJ1O1orXPM9o
definition: A language spoken by the Hmong people, also known as Mong, which belongs to the top-level class of Language in the context of legal matters.