NATO-6 Visa
type: Class
alternative label: International Military Alliance Civilian Component Visa
alternative label: NATO Civilian Component Visa
alternative label: NATO Civilian Employee Visa
alternative label: NATO Contractor Visa
subclass of: RDeH9slXtJOmFPiZhIzsDUg
definition: A NATO-6 visa is issued to members of a civilian component attached to NATO armed forces, allowing them to enter the U.S. to perform their duties. This visa category includes civilian employees and contractors working directly with NATO military operations.