Motion to Exclude
type: Class
alternative label: 排除动议
subclass of: R7SdenAJ4aI0wyuxBsP7c09
definition: A Motion to Exclude is a legal request made by a party in a trial to prevent certain evidence, documents, reports, witnesses, or testimony from being presented or considered by the court.