Employment Discrimination Claims
type: Class
alternative label: 就业歧视索赔
subclass of: R8UnJ8s91KxQbW7GpGgIhsP
subclass of: RCty0MaQzrLC9KnzjM7nMER
definition: A claim made by an employee alleging unfair treatment or disparate impact based on a protected characteristic such as race, gender, age, or disability in the workplace.