Procedural Unconscionability Permitting Contract Rescission
type: Class
alternative label: 程序上的不合理性允许合同撤销
subclass of: R8o77OqyndqK7R237rr61yE
definition: Procedural Unconscionability Permitting Contract Rescission: A legal concept that allows a contract to be cancelled due to unfair or oppressive terms or conditions that were imposed upon one party during the formation of the contract.