Motion to Enforce Settlement
type: Class
alternative label: 强制执行和解动议书
subclass of: R8OXAl4XER5P7DRJEzq7Hg7
definition: A Motion to Enforce Settlement is a legal request made to a court to enforce the terms of a previously agreed upon settlement between parties.