Citation to the Record
type: Class
alternative label: 引用记录
subclass of: RdxEgRnL667VicSJJV3xiZ
definition: A document's citations to the record (e.g., exhibits, appendices, deposition transcripts, declarations).