New Mexico Magistrate Court
type: Class
subclass of: R0D401c6E3b7d715c1eAF69c
definition: The New Mexico Magistrate Court is a court within the New Mexico State Courts system that has jurisdiction over minor criminal offenses, civil cases, and traffic violations.