JF20 Obtaining and reviewing documents (UK J-CODE)
type: Class
subclass of: RBYu7mrAChLYwfT9Szd5d2x
definition: Obtaining and reviewing documents to determine relevance (applicable to both manual and e-disclosure).