Justice of the Peace
type: Class
alternative label: 和平法官
subclass of: RCLoy4oZcw6FxnWja39PwnD
definition: A judicial officer who in some jurisdictions is permitted to enforce the laws for the preservation of the public peace.