Notice of Hearing
type: Class
alternative label: 听证通知
subclass of: RB3FT9lFNQIjRnFIueLgCa7
definition: A Notice of Hearing is a written communication that informs a party of a scheduled hearing or proceeding.