Indiana City Court - Hamilton County, Carmel City
type: Class
subclass of: RB2WeMKEJKLlp2qzlwh5Cay
definition: Indiana City Court - Hamilton County, Carmel City is a specific court located in Hamilton County, Carmel City, Indiana that has jurisdiction over certain legal matters within its geographical boundaries.