Domain Name Management
type: Class
subclass of: R8Xrium2aVaYqlV8F4UZu6u
definition: Domain Name Management refers to the legal management and protection of internet domain names, including registration, transfer, and dispute resolution.