Lead Poisoning Claims
type: Class
alternative label: 铅中毒索赔
subclass of: R8alUnZrt8GVEzHYhh1KTva
subclass of: RYS2M2cunzcjtIHPdPzmUy
definition: A claim for damages resulting from exposure to toxic levels of lead, typically in the context of personal injury litigation.