Police Officer
type: Class
alternative label: 警察
subclass of: RILQypXcjvqd1GxNIcqsb7
definition: A member of a police force or other organization of a municipality who is responsible for the prevention and detection of crime and the enforcement of the general criminal laws of the state. Aldazabal v. Carey, 396 N.Y.S.2d 84, 58 A.D.2d 120 (N.Y. App. Div. 1977)