Rule Type
type: Class
alternative label: 规则类型
subclass of: RDahKqXGI4trE9V8iw0YfR0
definition: A Rule Type is a specific type of Litigation Procedural Rule that outlines the procedures and requirements for a particular type of legal case, such as a pilot case or a case with complex issues.