Motion to Amend Complaint
type: Class
alternative label: 修改起诉书动议
subclass of: RCVdu7SLWG41yGP4XqRGGpB
definition: A Motion to Amend Complaint is a formal request made to a court to modify or change the allegations or claims made in a legal complaint.