Definition of Environmental Laws Clause
type: Class
alternative label: 环境法律条款定义
subclass of: RDe0RKU39BlhcyACJW30ZLc
definition: A provision in a contract that outlines the legal requirements and obligations related to the protection and preservation of the natural environment.