Motion to Compel
type: Class
alternative label: 强制令动议
subclass of: R8zwKGkogGKIKWSVWb1ItRL
subclass of: R9Ii4OzSADsjS0VegX12oQJ
definition: A Motion to Compel is a legal request made to a court to force the opposing party to comply with a discovery request or court order.