Kurdish
type: Class
alternative label: 库尔德语
subclass of: RDOvAHsvY8TKJ1O1orXPM9o
definition: Kurdish (Language) is a structured system of communication that consists of grammar and vocabulary specific to the Kurdish language, used in legal matters.