Vendor Advisory Services
type: Class
subclass of: R9EU57yyGYQyG3GeOJ1VgMr
definition: Vendor Advisory Services refers to professional advice and guidance provided by a consultant or manager to vendors, aimed at improving their business operations and strategies.