Mandingo
type: Class
alternative label: 曼丁哥
subclass of: RDOvAHsvY8TKJ1O1orXPM9o
definition: A language spoken primarily in West Africa, including in countries such as Guinea, Sierra Leone, and Liberia.