Firm Partner / Shareholder
type: Class
alternative label: 公司合伙人/股东
subclass of: RcTA2iQmrtqOnX3WrjJIp8
definition: A Firm Partner/Shareholder is a lawyer who holds an ownership interest in a law firm, either as an equity or non-equity partner.