Applied Law
type: Class
alternative label: 应用法律
subclass of: RBUPYY4wgW05EfNJ6kDq8mb
definition: The legal authority (e.g., judicial opinion, statute, regulation) has been applied by some decisionmaker (e.g., judge, regulator).