Permanent Injunction
type: Class
alternative label: 永久禁令
subclass of: R9rhwkH0GU868poYsoFKzVb
definition: A Permanent Injunction is a court order that prohibits a party from performing a specific act or engaging in certain conduct, and remains in effect indefinitely or until modified or dissolved by the court.