Gujarati
type: Class
alternative label: 古吉拉特语
subclass of: RDOvAHsvY8TKJ1O1orXPM9o
definition: Gujarati (Language) is a structured system of communication that consists of grammar and vocabulary specific to the Gujarati-speaking community.