Discount Amount - Fee or Expense
type: Class
alternative label: 折扣金额 - 费用或支出
subclass of: R8DuEmmnbcptnIZhPdF2Tvx
definition: Discount Amount - Fee or Expense refers to a reduction in the amount charged for legal services or expenses incurred during the engagement.