End-to-End Case Management
type: Class
subclass of: R9O8DfnQ5nFlMiycGkJ0eDG
definition: End-to-End Case Management refers to the process of managing a legal case from start to finish, including all aspects of litigation management.