Scenic and Sightseeing Transportation Industry
type: Class
alternative label: 风景和观光运输业
subclass of: RUE4fCCSnGX1wIK324EyiL
hidden label: SCET
definition: Industries in this group utilize transportation equipment to provide recreation and entertainment. These activities have a production process distinct from passenger transportation carried out for the purpose of other types of for-hire transportation. transport may be by ground, air, rail water or other means. This process does not emphasize efficient transportation; in fact, such activities often use obsolete vehicles, such as steam trains, to provide some extra ambiance.