Yiddish
type: Class
alternative label: 意第绪语
subclass of: RDOvAHsvY8TKJ1O1orXPM9o
definition: Yiddish is a structured system of communication that consists of grammar and vocabulary, and is a language used in legal matters.