Kansas District Court - Montgomery County, Independence
type: Class
subclass of: R8ahGaNbVpIwATBsrRg3EZp
definition: The Kansas District Court - Montgomery County, Independence is a specific court within the Kansas District Court system that has jurisdiction over legal matters within Montgomery County, Kansas.