Interlingue; Occidental
type: Class
subclass of: RDOvAHsvY8TKJ1O1orXPM9o
definition: A constructed language designed to be easy to learn and understand, with a simplified grammar and vocabulary, intended for use as a universal second language.