US Chapter 11 - Small Business Debtors
type: Class
subclass of: RE5Fc26D4606fC0Cd7664845
definition: Chapter 11 of the United States Bankruptcy Code allows small businesses to restructure their debts while continuing operations under court supervision. It provides a mechanism for small businesses to create a repayment plan to satisfy creditors and emerge as a viable entity.