690 Other Nature of Suit (PACER NoS)
type: Class
subclass of: RCSGywkPBv7f2ACrfTSiirV
definition: Action primarily based on Acts or Bills that cannot be classified under any other nature of suit, such as: Endangered Species Act, Federal Hazardous Substance Act 15:1261, Game & Wildlife Act 15:256C et seq. (Penalty), Federal Trade Commission Act 15:41-51 (Penalty), Federal Coal Mine Health & Safety Act 30:801 et seq. (Penalty), Load Line Act 46:85-85G, McGuire Bill (Federal Fair Trade) 15:45L Penalty, Marihuana Tax Act 50 STAT 551, Motorboat Act 46:526-526T, National Traffic & Motor Vehicle Safety Act penalty 49:1655, Veterans' Benefit Act, Title 38 Penalty.