Assumption of Lease Clause
type: Class
alternative label: 租赁承接条款
subclass of: RDe0RKU39BlhcyACJW30ZLc
definition: An Assumption of Lease Clause is a provision in a contract that obligates a party to take over the rights and obligations of an existing lease agreement.