Indiana Superior Court - Montgomery County
type: Class
subclass of: R7uq2Mq8qLUybQoDhVczzZ5
definition: Indiana Superior Court - Montgomery County: A court of general jurisdiction in Indiana that has the authority to hear and decide a wide range of legal cases within Montgomery County.