Legend On Stock Certificates Clause
type: Class
alternative label: 股票证书传说条款
subclass of: RDe0RKU39BlhcyACJW30ZLc
definition: A Legend On Stock Certificates Clause is a contractual clause that requires certain information to be printed on stock certificates, such as restrictions on transfer or ownership.