Reentry
type: Class
alternative label: 再入境
subclass of: R97svnIdQhrkKZw6i3Nn88z
definition: The concept of "Reentry" refers to the process of a tenant returning to a rental property after being evicted or leaving voluntarily, and the legal issues that may arise in relation to this return.