Act of Co-employee Not Within the Scope of Employment
type: Class
alternative label: 同事行为不在职责范围内
subclass of: R85GQaqi3P8fuEDkEpx55YE
definition: An act of a fellow employee that falls outside the scope of their job duties and is not related to the employer's business or interests, which may not be compensable under industrial injury claims.