Civil Union
type: Class
preferred label: Committed Relationship
alternative label: Civil partnership
subclass of: RDgLz1KvQn0YL8W61rW55T4
definition: A civil union is a legally recognized arrangement similar to marriage, which provides some of the legal and social protections afforded to married couples. However, it may lack some of the federal benefits and recognition that come with marriage.