Subject Person Clause
type: Class
alternative label: 主体人条款
subclass of: RDe0RKU39BlhcyACJW30ZLc
definition: A Subject Person Clause is a clause in a contract that identifies a specific individual or group of individuals who will be affected by the terms of the contract.