matter_tax_on_fees
type: Class
subclass of: RCdJG6uCwl9vj0GwxJe7mez
definition: "Sum of all TAX_SUMMARY.total_tax_on_fees for matter/invoice. This figure includes Withholding Taxes but not Tiered Taxes. "